The Ur-Quan Masters Home Page Welcome, Guest. Please login or register.
Did you miss your activation email?
December 05, 2021, 10:15:07 pm
Home Help Search Login Register
News: Paul & Fred have reached a settlement with Stardock!

  Show Posts
Pages: [1] 2
1  The Ur-Quan Masters Re-Release / General UQM Discussion / Re: Scale on: May 03, 2005, 03:59:25 am
I haven't read all of the eight pages, but here is my main thought on ship sizes.

I think that the smaller a space ship is the better. Larger ships need more material then smaller ones, obviously. If you are going to make 100's of Earth Cruisers, then for the sake of money, labor, and time you should make them as small and efficient as possible, but not too small that it hampers their battle value. Take this example: The U.S.A. needs to build 1,000,000 cars as fast as they can, because these cars fight an evil that is threatening to destroy the country. Now, would the government decide that we are going to build 1,000,000 semi-trucks or 1,000,000 little easy to make cars that do the job well enough?

Lastly, you have to factor in that Earth's government should treat their building materials as if they are limited, because the government will never know when they will run out of materials to build with.

Ok, there is my view. Hope it isn't to confusing.
2  The Ur-Quan Masters Re-Release / Technical Issues / Re: Switching Ship Weapons on: May 03, 2005, 03:23:20 am
Quote
This is a little complex but I recommend that you give this a try to learn better how the code works.

The main reason I'm trying to switch stuff around.

It was hard until you pointed me towards 'mycon_postprocess()'. Then all I did was copy/paste the function over the human_postprocess, then I renamed mycon_postprocess to human_postprocess. It worked! All I have to do now is to change the '#define's to make it like the mycon.

How hard would it be to make a third weapon? Like a Thraddash Torch with a third weapon that is the Shofixti Scout Blaze of Glory? Or a Yehat with a Spathi BUTT as a third weapon?
3  The Ur-Quan Masters Re-Release / Technical Issues / Switching Ship Weapons on: May 02, 2005, 08:49:22 am
I’ve mostly been changing variables in the code, but I want to go a step further. I was thinking of changing the ships primary and secondary weapons with other ships. IE: An earthling cruiser that spawns crew like the mycon instead of having a point defense laser system, or a spathi that fires the Kohr spinning sawblades instead of their little plasma pellets.

How would you do this? I’ve tried switching the earthling cruisers secondary to other weapons from alien ships, but it wouldn’t work.
4  The Ur-Quan Masters Re-Release / Technical Issues / Re: Undeclared Error on: April 30, 2005, 06:55:46 pm
Thanks 0xdecode. I added:

#include "gameev.h"

to the top of load.c and it got built fine.
5  The Ur-Quan Masters Re-Release / Technical Issues / Re: Undeclared Error on: April 30, 2005, 04:55:34 am
Code:
#include "globdata.h"
is already in load.c

It still doesn't work.
6  The Ur-Quan Masters Re-Release / Technical Issues / Undeclared Error on: April 30, 2005, 03:58:43 am
I edited the src/sc2code/load.c

See http://uqm.stack.nl/cgi-bin/yabb/YaBB.pl?action=display;board=Gendiscuss;num=1086978888;start=0#3

Well When I went to build my changes, I got this:

Code:
gcc -o "obj/release/./src/sc2code/load.o" -c  -I/usr/local/include/SDL -Dmain=SDL_main -I/usr/local/include/SDL -Dmain=SDL_main -O3 -DGFXMODULE_SDL -DHAVE_OPENGL  -DSOUNDMODULE_SDL  -DHAVE_ZIP=1  -I "." -I src -I src/sc2code -I src/sc2code/libs -I src/regex "src/sc2code/load.c"
src/sc2code/load.c: In function `LoadGame':
src/sc2code/load.c:197: error: `KOHR_AH_VICTORIOUS_EVENT' undeclared (first use in this function)
src/sc2code/load.c:197: error: (Each undeclared identifier is reported only once
src/sc2code/load.c:197: error: for each function it appears in.)
make: *** [obj/release/./src/sc2code/load.o] Error 1


Anyone know how to fix this?
7  The Ur-Quan Masters Re-Release / Technical Issues / Re: Ship Editing Help on: April 30, 2005, 02:04:20 am
Huzza! It works! I copied all the needed dll's and now the new built version works! A thousand thanks to you Novus. Also, thank you 0xdecode and Meep-Eep. Now to see what the changes did...
8  The Ur-Quan Masters Re-Release / Technical Issues / Re: Ship Editing Help on: April 29, 2005, 11:04:39 pm
I think I fixed this error on my own. See last time I just deleted 'typedef int ssize_t;' from sc2/src/port.h. This time I went to sc2/src/sc2code/libs/uio/uioport.h. I found the evil 'typedef int ssize_t;' and deleted it.

I tried './build.sh uqm' again. This time I think it got built entirely, because there was no errors. I looked under sc2 and saw the uqm.exe icon. I clicked it and it gave me the error, "This application has failed to start because SDL.dll was not found. Re-installing the application may fix this problem."

I have SDL.dll in MinGW/lib so why won't it work?
9  The Ur-Quan Masters Re-Release / Technical Issues / Re: Ship Editing Help on: April 29, 2005, 10:46:07 pm
Yeah, I had _G_config.txt in my mingw/include file. I opened it up and did 'save as' and made it _G_config.h. I guess that did the trick, because I './build.sh uqm' and a different error popped up instead. This error looks like the ssize_t error.

Code:
gcc -o "obj/release/./src/sc2code/libs/uio/charhashtable.o" -c  -I/usr/local/include/SDL -Dmain=SDL_main -I/usr/local/include/SDL -Dmain=SDL_main -O3 -DGFXMODULE_SDL -DHAVE_OPENGL  -DSOUNDMODULE_SDL  -DHAVE_ZIP=1  -I "." -I src -I src/sc2code -I src/sc2code/libs -I src/regex "src/sc2code/libs/uio/charhashtable.c"
In file included from src/sc2code/libs/uio/hashtable.h:31,
                from src/sc2code/libs/uio/charhashtable.h:33,
                from src/sc2code/libs/uio/charhashtable.c:23:
src/sc2code/libs/uio/uioport.h:74: error: conflicting types for 'ssize_t'
z:/uqmedit/edit/mingw/mingw/bin/../lib/gcc/mingw32/3.4.2/../../../../include/sys/types.h:104: error: previous declaration of 'ssize_t' was here
make: *** [obj/release/./src/sc2code/libs/uio/charhashtable.o] Error 1


This looks a little different then the previous ssize_t error, but
I thought I fixed this. Do I delete ssize_t from a different file?
10  The Ur-Quan Masters Re-Release / Technical Issues / Re: Ship Editing Help on: April 29, 2005, 07:58:28 pm
I deleted 'typedef int ssize_t;' from sc2/src/port.h
I tried './build.sh uqm' again and another batch of errors popped up. I don't have a middle button on my mouse, but it appears that pressing down on my scroller does the same thing.

Code:
z:/uqmedit/edit/mingw/mingw/bin/../lib/gcc/mingw32/3.4.2/../../../../include/ogg/os_types.h:38: error: syntax error before "ogg_int64_t"
z:/uqmedit/edit/mingw/mingw/bin/../lib/gcc/mingw32/3.4.2/../../../../include/ogg/os_types.h:39: error: syntax error before "ogg_int32_t"
z:/uqmedit/edit/mingw/mingw/bin/../lib/gcc/mingw32/3.4.2/../../../../include/ogg/os_types.h:40: error: syntax error before "ogg_uint32_t"
z:/uqmedit/edit/mingw/mingw/bin/../lib/gcc/mingw32/3.4.2/../../../../include/ogg/os_types.h:41: error: syntax error before "ogg_int16_t"
In file included from z:/uqmedit/edit/mingw/mingw/bin/../lib/gcc/mingw32/3.4.2/../../../../include/vorbis/codec.h:26,
                from src/sc2code/libs/sound/decoders/oggaud.c:28:
z:/uqmedit/edit/mingw/mingw/bin/../lib/gcc/mingw32/3.4.2/../../../../include/ogg/ogg.h:55: error: syntax error before "ogg_int64_t"
z:/uqmedit/edit/mingw/mingw/bin/../lib/gcc/mingw32/3.4.2/../../../../include/ogg/ogg.h:72: error: syntax error before "packetno"
z:/uqmedit/edit/mingw/mingw/bin/../lib/gcc/mingw32/3.4.2/../../../../include/ogg/ogg.h:77: error: syntax error before "granulepos"
z:/uqmedit/edit/mingw/mingw/bin/../lib/gcc/mingw32/3.4.2/../../../../include/ogg/ogg.h:90: error: syntax error before "ogg_int64_t"
z:/uqmedit/edit/mingw/mingw/bin/../lib/gcc/mingw32/3.4.2/../../../../include/ogg/ogg.h:132: error: syntax error before '*' token
z:/uqmedit/edit/mingw/mingw/bin/../lib/gcc/mingw32/3.4.2/../../../../include/ogg/ogg.h:133: error: syntax error before '*' token
z:/uqmedit/edit/mingw/mingw/bin/../lib/gcc/mingw32/3.4.2/../../../../include/ogg/ogg.h:134: error: syntax error before '*' token
z:/uqmedit/edit/mingw/mingw/bin/../lib/gcc/mingw32/3.4.2/../../../../include/ogg/ogg.h:147: error: syntax error before '*' token
z:/uqmedit/edit/mingw/mingw/bin/../lib/gcc/mingw32/3.4.2/../../../../include/ogg/ogg.h:148: error: syntax error before '*' token
z:/uqmedit/edit/mingw/mingw/bin/../lib/gcc/mingw32/3.4.2/../../../../include/ogg/ogg.h:149: error: syntax error before '*' token
z:/uqmedit/edit/mingw/mingw/bin/../lib/gcc/mingw32/3.4.2/../../../../include/ogg/ogg.h:153: error: syntax error before '*' token
z:/uqmedit/edit/mingw/mingw/bin/../lib/gcc/mingw32/3.4.2/../../../../include/ogg/ogg.h:154: error: syntax error before '*' token
z:/uqmedit/edit/mingw/mingw/bin/../lib/gcc/mingw32/3.4.2/../../../../include/ogg/ogg.h:155: error: syntax error before '*' token
z:/uqmedit/edit/mingw/mingw/bin/../lib/gcc/mingw32/3.4.2/../../../../include/ogg/ogg.h:156: error: syntax error before '*' token
z:/uqmedit/edit/mingw/mingw/bin/../lib/gcc/mingw32/3.4.2/../../../../include/ogg/ogg.h:157: error: syntax error before '*' token
z:/uqmedit/edit/mingw/mingw/bin/../lib/gcc/mingw32/3.4.2/../../../../include/ogg/ogg.h:158: error: syntax error before '*' token
z:/uqmedit/edit/mingw/mingw/bin/../lib/gcc/mingw32/3.4.2/../../../../include/ogg/ogg.h:166: error: syntax error before "ogg_page_granulepos"
z:/uqmedit/edit/mingw/mingw/bin/../lib/gcc/mingw32/3.4.2/../../../../include/ogg/ogg.h:171: error: syntax error before '*' token
In file included from src/sc2code/libs/sound/decoders/oggaud.c:28:
z:/uqmedit/edit/mingw/mingw/bin/../lib/gcc/mingw32/3.4.2/../../../../include/vorbis/codec.h:77: error: syntax error before "ogg_int64_t"
z:/uqmedit/edit/mingw/mingw/bin/../lib/gcc/mingw32/3.4.2/../../../../include/vorbis/codec.h:80: error: syntax error before "glue_bits"
z:/uqmedit/edit/mingw/mingw/bin/../lib/gcc/mingw32/3.4.2/../../../../include/vorbis/codec.h:81: error: syntax error before "time_bits"
z:/uqmedit/edit/mingw/mingw/bin/../lib/gcc/mingw32/3.4.2/../../../../include/vorbis/codec.h:82: error: syntax error before "floor_bits"
z:/uqmedit/edit/mingw/mingw/bin/../lib/gcc/mingw32/3.4.2/../../../../include/vorbis/codec.h:83: error: syntax error before "res_bits"
z:/uqmedit/edit/mingw/mingw/bin/../lib/gcc/mingw32/3.4.2/../../../../include/vorbis/codec.h:86: error: syntax error before '}' token
z:/uqmedit/edit/mingw/mingw/bin/../lib/gcc/mingw32/3.4.2/../../../../include/vorbis/codec.h:100: error: syntax error before "ogg_int64_t"
z:/uqmedit/edit/mingw/mingw/bin/../lib/gcc/mingw32/3.4.2/../../../../include/vorbis/codec.h:102: error: syntax error before '*' token
z:/uqmedit/edit/mingw/mingw/bin/../lib/gcc/mingw32/3.4.2/../../../../include/vorbis/codec.h:113: error: conflicting types for 'glue_bits'
z:/uqmedit/edit/mingw/mingw/bin/../lib/gcc/mingw32/3.4.2/../../../../include/vorbis/codec.h:80: error: previous declaration of 'glue_bits' was here
z:/uqmedit/edit/mingw/mingw/bin/../lib/gcc/mingw32/3.4.2/../../../../include/vorbis/codec.h:114: error: conflicting types for 'time_bits'
z:/uqmedit/edit/mingw/mingw/bin/../lib/gcc/mingw32/3.4.2/../../../../include/vorbis/codec.h:81: error: previous declaration of 'time_bits' was here
z:/uqmedit/edit/mingw/mingw/bin/../lib/gcc/mingw32/3.4.2/../../../../include/vorbis/codec.h:115: error: conflicting types for 'floor_bits'
z:/uqmedit/edit/mingw/mingw/bin/../lib/gcc/mingw32/3.4.2/../../../../include/vorbis/codec.h:82: error: previous declaration of 'floor_bits' was here
z:/uqmedit/edit/mingw/mingw/bin/../lib/gcc/mingw32/3.4.2/../../../../include/vorbis/codec.h:116: error: conflicting types for 'res_bits'
z:/uqmedit/edit/mingw/mingw/bin/../lib/gcc/mingw32/3.4.2/../../../../include/vorbis/codec.h:83: error: previous declaration of 'res_bits' was here
z:/uqmedit/edit/mingw/mingw/bin/../lib/gcc/mingw32/3.4.2/../../../../include/vorbis/codec.h:120: error: syntax error before '}' token
z:/uqmedit/edit/mingw/mingw/bin/../lib/gcc/mingw32/3.4.2/../../../../include/vorbis/codec.h:176: error: syntax error before '*' token
z:/uqmedit/edit/mingw/mingw/bin/../lib/gcc/mingw32/3.4.2/../../../../include/vorbis/codec.h:177: error: syntax error before '*' token
z:/uqmedit/edit/mingw/mingw/bin/../lib/gcc/mingw32/3.4.2/../../../../include/vorbis/codec.h:178: error: syntax error before '*' token
z:/uqmedit/edit/mingw/mingw/bin/../lib/gcc/mingw32/3.4.2/../../../../include/vorbis/codec.h:182: error: syntax error before '*' token
z:/uqmedit/edit/mingw/mingw/bin/../lib/gcc/mingw32/3.4.2/../../../../include/vorbis/codec.h:183: error: syntax error before "ogg_packet"
z:/uqmedit/edit/mingw/mingw/bin/../lib/gcc/mingw32/3.4.2/../../../../include/vorbis/codec.h:184: error: syntax error before '*' token
z:/uqmedit/edit/mingw/mingw/bin/../lib/gcc/mingw32/3.4.2/../../../../include/vorbis/codec.h:189: error: syntax error before '*' token
z:/uqmedit/edit/mingw/mingw/bin/../lib/gcc/mingw32/3.4.2/../../../../include/vorbis/codec.h:190: error: syntax error before '*' token
z:/uqmedit/edit/mingw/mingw/bin/../lib/gcc/mingw32/3.4.2/../../../../include/vorbis/codec.h:191: error: syntax error before '*' token
z:/uqmedit/edit/mingw/mingw/bin/../lib/gcc/mingw32/3.4.2/../../../../include/vorbis/codec.h:192: error: syntax error before '*' token
z:/uqmedit/edit/mingw/mingw/bin/../lib/gcc/mingw32/3.4.2/../../../../include/vorbis/codec.h:194: error: syntax error before '*' token
z:/uqmedit/edit/mingw/mingw/bin/../lib/gcc/mingw32/3.4.2/../../../../include/vorbis/codec.h:195: error: syntax error before '*' token
z:/uqmedit/edit/mingw/mingw/bin/../lib/gcc/mingw32/3.4.2/../../../../include/vorbis/codec.h:200: error: syntax error before "ogg_packet"
z:/uqmedit/edit/mingw/mingw/bin/../lib/gcc/mingw32/3.4.2/../../../../include/vorbis/codec.h:202: error: syntax error before '*' token
z:/uqmedit/edit/mingw/mingw/bin/../lib/gcc/mingw32/3.4.2/../../../../include/vorbis/codec.h:203: error: syntax error before '*' token
z:/uqmedit/edit/mingw/mingw/bin/../lib/gcc/mingw32/3.4.2/../../../../include/vorbis/codec.h:204: error: syntax error before '*' token
z:/uqmedit/edit/mingw/mingw/bin/../lib/gcc/mingw32/3.4.2/../../../../include/vorbis/codec.h:205: error: syntax error before '*' token
z:/uqmedit/edit/mingw/mingw/bin/../lib/gcc/mingw32/3.4.2/../../../../include/vorbis/codec.h:206: error: syntax error before '*' token
z:/uqmedit/edit/mingw/mingw/bin/../lib/gcc/mingw32/3.4.2/../../../../include/vorbis/codec.h:207: error: syntax error before '*' token
z:/uqmedit/edit/mingw/mingw/bin/../lib/gcc/mingw32/3.4.2/../../../../include/vorbis/codec.h:208: error: syntax error before "ogg_packet"
In file included from src/sc2code/libs/sound/decoders/oggaud.c:29:
z:/uqmedit/edit/mingw/mingw/bin/../lib/gcc/mingw32/3.4.2/../../../../include/vorbis/vorbisfile.h:41: error: syntax error before "ogg_int64_t"
z:/uqmedit/edit/mingw/mingw/bin/../lib/gcc/mingw32/3.4.2/../../../../include/vorbis/vorbisfile.h:55: error: syntax error before "ogg_int64_t"
z:/uqmedit/edit/mingw/mingw/bin/../lib/gcc/mingw32/3.4.2/../../../../include/vorbis/vorbisfile.h:62: error: syntax error before '*' token
z:/uqmedit/edit/mingw/mingw/bin/../lib/gcc/mingw32/3.4.2/../../../../include/vorbis/vorbisfile.h:63: error: syntax error before '*' token
z:/uqmedit/edit/mingw/mingw/bin/../lib/gcc/mingw32/3.4.2/../../../../include/vorbis/vorbisfile.h:65: error: syntax error before '*' token
z:/uqmedit/edit/mingw/mingw/bin/../lib/gcc/mingw32/3.4.2/../../../../include/vorbis/vorbisfile.h:72: error: syntax error before "pcm_offset"
z:/uqmedit/edit/mingw/mingw/bin/../lib/gcc/mingw32/3.4.2/../../../../include/vorbis/vorbisfile.h:80: error: syntax error before "os"
z:/uqmedit/edit/mingw/mingw/bin/../lib/gcc/mingw32/3.4.2/../../../../include/vorbis/vorbisfile.h:82: error: syntax error before "vd"
z:/uqmedit/edit/mingw/mingw/bin/../lib/gcc/mingw32/3.4.2/../../../../include/vorbis/vorbisfile.h:82: error: conflicting types for 'vd'
z:/uqmedit/edit/mingw/mingw/bin/../lib/gcc/mingw32/3.4.2/../../../../include/vorbis/codec.h:102: error: previous declaration of 'vd' was here
z:/uqmedit/edit/mingw/mingw/bin/../lib/gcc/mingw32/3.4.2/../../../../include/vorbis/vorbisfile.h:83: error: syntax error before "vb"
z:/uqmedit/edit/mingw/mingw/bin/../lib/gcc/mingw32/3.4.2/../../../../include/vorbis/vorbisfile.h:87: error: syntax error before '}' token
z:/uqmedit/edit/mingw/mingw/bin/../lib/gcc/mingw32/3.4.2/../../../../include/vorbis/vorbisfile.h:89: error: syntax error before '*' token
z:/uqmedit/edit/mingw/mingw/bin/../lib/gcc/mingw32/3.4.2/../../../../include/vorbis/vorbisfile.h:90: error: syntax error before "OggVorbis_File"
z:/uqmedit/edit/mingw/mingw/bin/../lib/gcc/mingw32/3.4.2/../../../../include/vorbis/vorbisfile.h:91: error: syntax error before "OggVorbis_File"
z:/uqmedit/edit/mingw/mingw/bin/../lib/gcc/mingw32/3.4.2/../../../../include/vorbis/vorbisfile.h:94: error: syntax error before "OggVorbis_File"
z:/uqmedit/edit/mingw/mingw/bin/../lib/gcc/mingw32/3.4.2/../../../../include/vorbis/vorbisfile.h:95: error: syntax error before "OggVorbis_File"
z:/uqmedit/edit/mingw/mingw/bin/../lib/gcc/mingw32/3.4.2/../../../../include/vorbis/vorbisfile.h:97: error: syntax error before '*' token
z:/uqmedit/edit/mingw/mingw/bin/../lib/gcc/mingw32/3.4.2/../../../../include/vorbis/vorbisfile.h:99: error: syntax error before '*' token
z:/uqmedit/edit/mingw/mingw/bin/../lib/gcc/mingw32/3.4.2/../../../../include/vorbis/vorbisfile.h:100: error: syntax error before '*' token
z:/uqmedit/edit/mingw/mingw/bin/../lib/gcc/mingw32/3.4.2/../../../../include/vorbis/vorbisfile.h:101: error: syntax error before '*' token
z:/uqmedit/edit/mingw/mingw/bin/../lib/gcc/mingw32/3.4.2/../../../../include/vorbis/vorbisfile.h:102: error: syntax error before '*' token
z:/uqmedit/edit/mingw/mingw/bin/../lib/gcc/mingw32/3.4.2/../../../../include/vorbis/vorbisfile.h:103: error: syntax error before '*' token
z:/uqmedit/edit/mingw/mingw/bin/../lib/gcc/mingw32/3.4.2/../../../../include/vorbis/vorbisfile.h:105: error: syntax error before "ov_raw_total"
z:/uqmedit/edit/mingw/mingw/bin/../lib/gcc/mingw32/3.4.2/../../../../include/vorbis/vorbisfile.h:105: error: syntax error before '*' token
z:/uqmedit/edit/mingw/mingw/bin/../lib/gcc/mingw32/3.4.2/../../../../include/vorbis/vorbisfile.h:106: error: syntax error before "ov_pcm_total"
z:/uqmedit/edit/mingw/mingw/bin/../lib/gcc/mingw32/3.4.2/../../../../include/vorbis/vorbisfile.h:106: error: syntax error before '*' token
z:/uqmedit/edit/mingw/mingw/bin/../lib/gcc/mingw32/3.4.2/../../../../include/vorbis/vorbisfile.h:107: error: syntax error before '*' token
z:/uqmedit/edit/mingw/mingw/bin/../lib/gcc/mingw32/3.4.2/../../../../include/vorbis/vorbisfile.h:109: error: syntax error before '*' token
z:/uqmedit/edit/mingw/mingw/bin/../lib/gcc/mingw32/3.4.2/../../../../include/vorbis/vorbisfile.h:110: error: syntax error before '*' token
z:/uqmedit/edit/mingw/mingw/bin/../lib/gcc/mingw32/3.4.2/../../../../include/vorbis/vorbisfile.h:111: error: syntax error before '*' token
z:/uqmedit/edit/mingw/mingw/bin/../lib/gcc/mingw32/3.4.2/../../../../include/vorbis/vorbisfile.h:112: error: syntax error before '*' token
z:/uqmedit/edit/mingw/mingw/bin/../lib/gcc/mingw32/3.4.2/../../../../include/vorbis/vorbisfile.h:113: error: syntax error before '*' token
z:/uqmedit/edit/mingw/mingw/bin/../lib/gcc/mingw32/3.4.2/../../../../include/vorbis/vorbisfile.h:115: error: syntax error before "ov_raw_tell"
z:/uqmedit/edit/mingw/mingw/bin/../lib/gcc/mingw32/3.4.2/../../../../include/vorbis/vorbisfile.h:115: error: syntax error before '*' token
z:/uqmedit/edit/mingw/mingw/bin/../lib/gcc/mingw32/3.4.2/../../../../include/vorbis/vorbisfile.h:116: error: syntax error before "ov_pcm_tell"
z:/uqmedit/edit/mingw/mingw/bin/../lib/gcc/mingw32/3.4.2/../../../../include/vorbis/vorbisfile.h:116: error: syntax error before '*' token
z:/uqmedit/edit/mingw/mingw/bin/../lib/gcc/mingw32/3.4.2/../../../../include/vorbis/vorbisfile.h:117: error: syntax error before '*' token
z:/uqmedit/edit/mingw/mingw/bin/../lib/gcc/mingw32/3.4.2/../../../../include/vorbis/vorbisfile.h:119: error: syntax error before '*' token
z:/uqmedit/edit/mingw/mingw/bin/../lib/gcc/mingw32/3.4.2/../../../../include/vorbis/vorbisfile.h:120: error: syntax error before '*' token
z:/uqmedit/edit/mingw/mingw/bin/../lib/gcc/mingw32/3.4.2/../../../../include/vorbis/vorbisfile.h:122: error: syntax error before '*' token
z:/uqmedit/edit/mingw/mingw/bin/../lib/gcc/mingw32/3.4.2/../../../../include/vorbis/vorbisfile.h:124: error: syntax error before '*' token
src/sc2code/libs/sound/decoders/oggaud.c:71: error: syntax error before "OggVorbis_File"
src/sc2code/libs/sound/decoders/oggaud.c:71: warning: no semicolon at end of struct or union
src/sc2code/libs/sound/decoders/oggaud.c:73: warning: data definition has no type or storage class
src/sc2code/libs/sound/decoders/oggaud.c:84: error: syntax error before "ogg_int64_t"
src/sc2code/libs/sound/decoders/oggaud.c: In function `ogg_seek':
src/sc2code/libs/sound/decoders/oggaud.c:86: error: `offset' undeclared (first use in this function)
src/sc2code/libs/sound/decoders/oggaud.c:86: error: (Each undeclared identifier is reported only once
src/sc2code/libs/sound/decoders/oggaud.c:86: error: for each function it appears in.)
src/sc2code/libs/sound/decoders/oggaud.c:87: error: `datasource' undeclared (first use in this function)
src/sc2code/libs/sound/decoders/oggaud.c:87: error: `whence' undeclared (first use in this function)
src/sc2code/libs/sound/decoders/oggaud.c: In function `ova_GetError':
src/sc2code/libs/sound/decoders/oggaud.c:140: error: `ova' undeclared (first use in this function)
src/sc2code/libs/sound/decoders/oggaud.c:140: error: syntax error before ')' token
src/sc2code/libs/sound/decoders/oggaud.c: In function `ova_Open':
src/sc2code/libs/sound/decoders/oggaud.c:164: error: `ova' undeclared (first use in this function)
src/sc2code/libs/sound/decoders/oggaud.c:164: error: syntax error before ')' token
src/sc2code/libs/sound/decoders/oggaud.c: In function `ova_Close':
src/sc2code/libs/sound/decoders/oggaud.c:212: error: `ova' undeclared (first use in this function)
src/sc2code/libs/sound/decoders/oggaud.c:212: error: syntax error before ')' token
src/sc2code/libs/sound/decoders/oggaud.c: In function `ova_Decode':
src/sc2code/libs/sound/decoders/oggaud.c:220: error: `ova' undeclared (first use in this function)
src/sc2code/libs/sound/decoders/oggaud.c:220: error: syntax error before ')' token
src/sc2code/libs/sound/decoders/oggaud.c: In function `ova_Seek':
src/sc2code/libs/sound/decoders/oggaud.c:238: error: `ova' undeclared (first use in this function)
src/sc2code/libs/sound/decoders/oggaud.c:238: error: syntax error before ')' token
src/sc2code/libs/sound/decoders/oggaud.c: In function `ova_GetFrame':
src/sc2code/libs/sound/decoders/oggaud.c:254: error: `ova' undeclared (first use in this function)
src/sc2code/libs/sound/decoders/oggaud.c:254: error: syntax error before ')' token
make: *** [obj/release/./src/sc2code/libs/sound/decoders/oggaud.o] Error 1
11  The Ur-Quan Masters Re-Release / Technical Issues / Re: Ship Editing Help on: April 29, 2005, 01:40:35 am
Ok, so I turned debugging off, cuz I have no coding knowledge. Now I'm going to './build.sh uqm' and see what happens... It is stuck on 'Building dependency information...'
Oh, no. There is an error. I'll just type all of it down, since there is no copy paste for it.

Code:
gcc -o "obj/release/./src/options.o" -c  -I/user/local/include/SDL -Dmain=SDL_main -I/usr/local/include/SDL -Dmain=SDL_main -03 -DGFXMODULE_SDL -DHAVE_OPENGL  -DSOUNDMODULE_SDL  -DHAVE_ZIP=1  -I "." -I src -I src/sc2code -I src/sc2code/libs -I src/regex "scr/options.c"
In file included from src/options.h:25,
                             from src/options.c:22:
src/port.h:58: error: conflicting types for 'ssize_t'
z:/uqmedit/edit/mingw/mingw/bin/../lib/gcc/mingw32/3.4.2/../../../../include/sys/types.h:104: error: previous declaration of 'ssize_t' was here
make: *** [obj/release/./src/options.o] Error 1


Ok so there you go. Have no clue what is wrong, but I think I have two of the same 'ssize_t'. So do I just delete one of them?
12  The Ur-Quan Masters Re-Release / Technical Issues / Re: Ship Editing Help on: April 28, 2005, 09:25:40 pm
YES! IT WORKS! Sorry, I'm just very happy that it is working.

Ok, so I got MSYS going again then cd to SDL and then I './configure; make; make install' After a heck load of text it was finished. Then I cd to /z/uqmedit/sc2 and './build.sh uqm config' and it worked! Now I have come to a main menu:

1. Include debugging information        Debugging information
2. OpenGL graphics support              Including OpenGL graphics support
3. Sound backend                             Use MixSDL for sound (internal)
4. Supported file i/o methods              Direct & .zip file i/o
5. Installation paths                           [...]

I'm going mess around with it for awhile. Which number should I go with to make the changes?
13  The Ur-Quan Masters Re-Release / Technical Issues / Re: Ship Editing Help on: April 28, 2005, 12:07:40 am
I didn't even have SDL on my computer. At least, I didn't have a working version of it. So I found the SDL homepage and downloaded the SDL 1.2.8 and then read the INSTALL file with notepad. It says something along the line of:
" Run './configure; make; make install' "
So I started up MSYS and 'cd' to where SDL was located and typed:
./configure
Then It looked like a flash flood of text. It kept checking stuff then it built new files. Was this the correct way to install it?

Then after it got done, I 'cd' to /z/uqmedit/sc2 and typed:
./build.sh uqm config
It still gave me the same error as before.
What am I doing wrong?
14  The Ur-Quan Masters Re-Release / Technical Issues / Re: Ship Editing Help on: April 27, 2005, 02:35:56 am
I moved the sc2 folder to /z/uqmedit.
I changed fstab and it worked, but now I have a different problem.

Quote
Zach@DESKTOP /z/uqmedit/sc2
$ ./build.sh uqm config
'echo -n' capable echo found.
Sed stream editor found.
tr found.
Make found.
GNU C compiler found.
windres found.
Little-endian machine.
build/unix/build.sh: sdl-config: command not found
build/unix/build.sh: sdl-config: command not found
build/unix/build.sh: sdl-config: command not found
Fatal: Could not determine version of Simple DirectMedia Layer

Zach@DESKTOP /z/uqmedit/sc2
$


Thanks to the MOD who moved this topic.
15  The Ur-Quan Masters Re-Release / Technical Issues / Re: Ship Editing Help on: April 26, 2005, 07:43:58 pm
I follow the instructions all the way up to when you run MSYS. Here is what it says.

Quote
Zach@DESKTOP ~
$ cd /z/uqm/content/packages/sc2

Zach@DESKTOP /z/uqm/content/packages/sc2
$ ./build.sh uqm config
'echo -n' capable echo found.
Sed stream editor found.
tr found.
Make found.
GNU C compiler not found.

Zach@DESKTOP /z/uqm/content/packages/sc2
$


You'll noticed I have the downloaded module 'sc2' from the repository in the packages folder. Should I move the sc2 folder somewhere else?

It says GNU C compiler not found. I'm assuming this is the problem. How do I fix it?

As you probably know by now, my name is Zach (and consequently my drive's name too).
Pages: [1] 2


Login with username, password and session length

Powered by MySQL Powered by PHP Powered by SMF 1.1.21 | SMF © 2015, Simple Machines Valid XHTML 1.0! Valid CSS!